{"text_format":"1","workbook":"xlsx","n_sheets":6,"sheets":["Cover crop worksheet","Table 1 Purpose ratings","Recommended Cover Crop Mixes","Aerial Seeding in SB","Aerial Seeding in Corn","DATA"],"not_rendered":{"charts":0,"images":2,"macros":1,"external_links":1,"defined_names":57,"comments":0,"pivot_tables":0},"unopened":[],"bounds":{"document_bytes":16777216,"sheet_cells":100000,"rows_first":2000,"rows_last":500,"rows_between":2000,"halvings":0,"cell_chars":16384,"cell_head_chars":4096},"cells_cut":0,"cells_raw":0,"read":"whole","date_system":"1900"}

{"sheet":"Cover crop worksheet","index":0,"n_rows":40,"n_cols":28,"rows_kept":40,"cut":false,"hidden":false,"merged":[[2,12,2,14],[27,3,27,6],[28,3,28,6],[29,3,29,6],[24,3,26,6],[3,12,3,16],[14,13,14,16],[23,1,23,16],[38,15,38,16],[29,1,29,2],[24,10,26,10],[24,11,26,11],[33,1,33,2],[31,3,31,6],[34,3,34,6],[32,3,32,6],[33,3,33,6],[31,15,31,16],[32,15,32,16],[35,15,35,16],[36,15,36,16],[24,15,26,16],[27,1,27,2],[28,1,28,2],[30,3,30,6],[30,1,30,2],[24,14,26,14],[27,15,27,16],[36,1,36,2],[35,3,35,6],[36,3,36,6],[34,1,34,2],[13,6,13,12],[24,12,26,12],[38,3,38,6],[35,1,35,2],[24,7,26,7],[24,9,26,9],[24,8,26,8],[38,1,38,2],[14,1,14,3],[15,1,15,16],[37,3,37,6],[20,8,20,12],[31,1,31,2],[32,1,32,2],[33,15,33,16],[7,13,7,16],[12,1,12,5],[12,6,12,12],[12,13,12,16],[13,13,13,16],[13,1,13,5],[8,6,8,12],[9,6,9,12],[11,1,11,3],[10,6,10,12],[11,6,11,12],[20,6,20,7],[2,2,2,7],[21,13,21,14],[7,1,7,3],[18,8,18,12],[21,6,21,7],[7,6,7,12],[6,6,6,12],[4,12,4,16],[18,13,18,14],[8,13,8,16],[9,13,9,16],[16,8,16,12],[16,13,16,14],[8,1,8,4],[9,1,9,3],[17,6,17,7],[17,8,17,12],[17,1,18,5],[10,13,10,16],[11,13,11,16],[4,2,4,7],[0,1,0,16],[37,15,37,16],[28,15,28,16],[29,15,29,16],[30,15,30,16],[34,15,34,16],[37,1,37,2],[24,1,26,2],[24,13,26,13],[20,13,20,14],[18,6,18,7],[21,8,21,12],[17,13,17,14],[20,1,21,5],[14,6,14,12]]}
[null,"COVER CROP SEEDING PLAN AND RECORD"]
[]
[null,"Producer:",null,null,null,null,null,null,null,null,"Cover Crop Purpose"]
[null,"Field Location:",null,null,null,null,null,null,null,null,"Seeding Date:"]
[null,"Acres: ",null,null,null,null,null,null,null,null,"Seeded by:"]
[]
[null,null,null,null,null,null,"PLANNED",null,null,null,null,null,null,null,null,"APPLIED"]
[null,"Field Number"]
[null,"Fertilization"]
[null,"Seeding Equipment",null,null,null,null,"Drill",null,null,null,null,null,null,null,null,null,null,null,"FullSeedList"]
[null,"Acres"]
[null,"Seeding Window",null,null,null,null,"April 1 through May 15 – predominantly cool-season species"]
[null,"Planned seeding date",null,null,null,null,"2022-03-15"]
[null,"Suggested Seeding Depth*"]
[null,"Termination Method",null,null,null,null,"Herbicide"]
[null,"CROP HISTORY"]
[null,null,null,null,null,null,null,null,"Herbicide(s) applied",null,null,null,null,"Application Date:"]
[null,"Current Crop:",null,null,null,null,"Oats",null,null,null,null,null,null,null,null,null,null,null,{"$f":"CropTable(G21)","v":0}]
[]
[]
[null,"Previous Crop:",null,null,null,null,null,null,null,null,null,null,null,null,null,null,null,null,{"$f":"CropTable(G18)","v":"SmallGrain"}]
[]
[]
[null,"PLANNED COVER CROP"]
[null,"Seed Species",null,"Variety",null,null,null,"Full Seeding Rate Pounds (lbs/ac)","Percent in Mixture","Planned Seeding Rate lbs/ac","Seed Cost ($/lb)","Total Cost","Acres to Seed","Total Lbs Required","Seeding Depth (Inches)","Potential Herbicide Carry-Over Conflicts, Refer to Herbicide Label"]
[null,null,null,null,null,null,null,null,null,null,null,null,null,null,null,null,null,null,null,null,{"$f":"IF(N21>0,($G13-N21)/30,0)","v":0},{"$f":"IF(N22>0,($G13-N22)/30,0)","v":0},{"$f":"IF(N18>0,($G13-N18)/30,0)","v":0},{"$f":"IF(N19>0,($G13-N19)/30,0)","v":0}]
[22]
[21,"Oats",null,null,null,null,null,{"$f":"IF(AND(ISTEXT(B28),G$10=\"Drill\"),VLOOKUP(B28,SpeciesTable,13,FALSE),IF(AND(ISTEXT(B28),G$10=\"Broadcast\"),VLOOKUP(B28,SpeciesTable,13,FALSE)*1.5,\"\"))","v":70},0.5,{"$f":"IF(ISTEXT(B28),H28*I28,\"0\")","v":35},0.47,{"$f":"K28*J28","v":16.45},null,{"$f":"IF(ISTEXT(B28),J28*M28,\"\")","v":0},{"$f":"IF(ISTEXT(B28),VLOOKUP(B28,SpeciesTable,14,FALSE),\"\")","v":".5 - 1.5"},{"$f":"IF(AND(ISTEXT(B28),ISTEXT(CarryOver(Y28,Z28,AA28,AB28))),CarryOver(Y28,Z28,AA28,AB28),\"\")","v":""},null,null,{"$f":"IF(ISTEXT(B28),VLOOKUP(B28,SpeciesTable,19,FALSE),\"\")","v":0.25},{"$f":"IF(ISTEXT(B28),VLOOKUP(B28,SpeciesTable,20,FALSE),\"\")","v":0.5},{"$f":"IF(ISERROR(VLOOKUP($I$21,CarryOverTable,VLOOKUP($B28,CoverCropTable,2,FALSE),FALSE)),0,VLOOKUP($I$21,CarryOverTable,VLOOKUP($B28,CoverCropTable,2,FALSE),FALSE))","v":0},{"$f":"IF(ISERROR(VLOOKUP($I$22,CarryOverTable,VLOOKUP($B28,CoverCropTable,2,FALSE),FALSE)),0,VLOOKUP($I$22,CarryOverTable,VLOOKUP($B28,CoverCropTable,2,FALSE),FALSE))","v":0},{"$f":"IF(ISERROR(VLOOKUP($I$18,CarryOverTable,VLOOKUP($B28,CoverCropTable,2,FALSE),FALSE)),0,VLOOKUP($I$18,CarryOverTable,VLOOKUP($B28,CoverCropTable,2,FALSE),FALSE))","v":0},{"$f":"IF(ISERROR(VLOOKUP($I$19,CarryOverTable,VLOOKUP($B28,CoverCropTable,2,FALSE),FALSE)),0,VLOOKUP($I$19,CarryOverTable,VLOOKUP($B28,CoverCropTable,2,FALSE),FALSE))","v":0},{"$f":"IF(U28>U$26,I$21,\"\")","v":""},{"$f":"IF(V28>V$26,I$22,\"\")","v":""},{"$f":"IF(W28>W$26,I$18,\"\")","v":""},{"$f":"IF(X28>X$26,I$19,\"\")","v":""}]
[22,null,null,null,null,null,null,{"$f":"IF(AND(ISTEXT(B29),G$10=\"Drill\"),VLOOKUP(B29,SpeciesTable,13,FALSE),IF(AND(ISTEXT(B29),G$10=\"Broadcast\"),VLOOKUP(B29,SpeciesTable,13,FALSE)*1.5,\"\"))","v":""},null,"0",null,{"$f":"K29*J29","v":0},null,{"$f":"IF(ISTEXT(B29),J29*M29,\"\")","v":""},{"$f":"IF(ISTEXT(B29),VLOOKUP(B29,SpeciesTable,14,FALSE),\"\")","v":""},{"$f":"IF(AND(ISTEXT(B29),ISTEXT(CarryOver(Y29,Z29,AA29,AB29))),CarryOver(Y29,Z29,AA29,AB29),\"\")","v":""},null,null,{"$f":"IF(ISTEXT(B29),VLOOKUP(B29,SpeciesTable,19,FALSE),\"\")","v":""},"",0,0,0,{"$f":"IF(ISERROR(VLOOKUP($I$19,CarryOverTable,VLOOKUP($B29,CoverCropTable,2,FALSE),FALSE)),0,VLOOKUP($I$19,CarryOverTable,VLOOKUP($B29,CoverCropTable,2,FALSE),FALSE))","v":0},"","","",""]
[23,null,null,null,null,null,null,"",null,"0",null,0,null,"","","",null,null,"","",0,0,0,0,"","","",""]
[24,null,null,null,null,null,null,"",null,"0",null,0,null,"","","",null,null,"","",0,0,0,0,"","","",""]
[null,null,null,null,null,null,null,"",null,"0",null,0,null,{"$f":"IF(ISTEXT(B32),J32*M32,\"\")","v":""},{"$f":"IF(ISTEXT(B32),VLOOKUP(B32,SpeciesTable,14,FALSE),\"\")","v":""},{"$f":"IF(AND(ISTEXT(B32),ISTEXT(CarryOver(Y32,Z32,AA32,AB32))),CarryOver(Y32,Z32,AA32,AB32),\"\")","v":""}]
[null,null,null,null,null,null,null,"",null,"0",null,0,null,"","",""]
[null,null,null,null,null,null,null,"",null,"0",null,0,null,"","",""]
[25,null,null,null,null,null,null,"",null,"0",null,0,null,"","","",null,null,"","",0,0,0,0,"","","",""]
[null,null,null,null,null,null,null,"",null,"0",null,0,{"$f":"IF(ISTEXT(B36),G$11,\"\")","v":""},{"$f":"IF(ISTEXT(B36),J36*M36,\"\")","v":""},{"$f":"IF(ISTEXT(B36),VLOOKUP(B36,SpeciesTable,14,FALSE),\"\")","v":""},{"$f":"IF(AND(ISTEXT(B36),ISTEXT(CarryOver(Y36,Z36,AA36,AB36))),CarryOver(Y36,Z36,AA36,AB36),\"\")","v":""}]
[null,null,null,null,null,null,null,"",null,"0",null,0,"","","",""]
[26,null,null,null,null,null,null,"",null,{"$f":"IF(ISTEXT(B38),H38*I38,\"0\")","v":"0"},null,0,{"$f":"IF(ISTEXT(B38),G$11,\"\")","v":""},"","","",null,null,"","",0,0,0,0,"","","",""]
[27,null,null,null,null,null,null,"",{"$f":"SUM(I28:I37)","v":0.5},{"$f":"IF(ISTEXT(B39),H39*I39,\"\")","v":""},null,{"$f":"SUM(L28:L38)","v":16.45},{"$f":"IF(ISTEXT(B39),G$11,\"\")","v":""},"","","",null,null,"","",0,0,0,0,"","","",""]
[28,null,null,null,null,null,null,null,null,null,null,null,null,null,null,null,null,null,{"$f":"MIN(S28:S39)","v":0.25},{"$f":"MIN(T28:T39)","v":0.5},{"$f":"IF(ISERROR(VLOOKUP($I$21,CarryOverTable,VLOOKUP(#REF!,CoverCropTable,2,FALSE),FALSE)),0,VLOOKUP($I$21,CarryOverTable,VLOOKUP(#REF!,CoverCropTable,2,FALSE),FALSE))","v":0},{"$f":"IF(ISERROR(VLOOKUP($I$22,CarryOverTable,VLOOKUP(#REF!,CoverCropTable,2,FALSE),FALSE)),0,VLOOKUP($I$22,CarryOverTable,VLOOKUP(#REF!,CoverCropTable,2,FALSE),FALSE))","v":0},{"$f":"IF(ISERROR(VLOOKUP($I$18,CarryOverTable,VLOOKUP(#REF!,CoverCropTable,2,FALSE),FALSE)),0,VLOOKUP($I$18,CarryOverTable,VLOOKUP(#REF!,CoverCropTable,2,FALSE),FALSE))","v":0},{"$f":"IF(ISERROR(VLOOKUP($I$19,CarryOverTable,VLOOKUP(#REF!,CoverCropTable,2,FALSE),FALSE)),0,VLOOKUP($I$19,CarryOverTable,VLOOKUP(#REF!,CoverCropTable,2,FALSE),FALSE))","v":0},"","","",""]
{"$rows_left_out":1}
{"sheet":"Table 1 Purpose ratings","index":1,"n_rows":63,"n_cols":20,"rows_kept":63,"cut":false,"hidden":false,"merged":[[62,0,62,17],[0,0,0,17],[45,0,45,5],[45,7,45,10],[45,13,45,17],[56,0,56,5]]}
["Table 1: Cover Crop - Common Species and Properties"]
["Cover Crop","Erosion Reduction","Increase soil organic matter ","Capture, recycle, redistribute nutrients in the soil profile","Promote biological nitrogen fixation ","Weed suppression","Provide supplemental hay","Provide supplemental grazing","Rooting Depth / Plant Water Use /1","Minimize / reduce soil compaction","Seed size (Large or Fine)","Crop Type  and Seeding Dates  /2 /3","Full Seeding rate, lbs/acre /4","Seeding depth, inches","Salinity tolerance","C:N Ratio ","Attract Beneficial Insects","Mycorrhizal fungi association "]
["Alfalfa","G","G","G","Y","G","F","F","DH","G","F","CB",6.5,".25 - .75","P","L","Y","M",0.25,0.75]
["Alsike clover","G","F","G","Y","G","F","F","SL","P","F","CB",3,".25 - .75","P","L","Y","M",0.25,0.75]
["Canola","F","F","G","N","P-G**","F","F","MM","G","F","CB",5,".25 - .75","G","L","Y","N",0.5,1.5]
["Chickling vetch","G","F","G","Y","F","F","F","SL","F","L","CB",50,".5 - 1.5","P","L","Y","M",0.75,2]
["Common vetch","G","F","F","Y","P","F","F","SM","F","L","CB",25,".5 - 1.5","P","L","Y","M",0.5,1.5]
["Crimson clover","G","F","G","Y","G","G","G","SM","F","F","CB",15,".25-.75","P","L","Y","M",0.25,0.75]
["Ethiopian cabbage","F","F","G","N","F","F","F","MM","G","F","CB",5,".25 - .75","G","L","Y","N",0.5,1.5]
["Flax","F","F","F","N","P","P","P","SM","P","F","CB",30,".25-.75","F","H","Y","H",0.5,1.5]
["Hairy vetch","G","F","F","Y","P","F","F","SM","F","L","CB",15,".5 - 1.5","P","L","Y","M",1,1.5]
["Kale","F","F","G","N","G","F","F","MM","G","F","CB",0.5,".25 - .5","G","L","Y","N",1,1.5]
["Lentils","P","P","F","Y","P","F","F","SL","P","F","CB",30,"1-1.5","P","L","Y","M",0.25,0.75]
["Mustard, oriental or brown","F","F","F","N","G","F","F","MH","F","F","CB",6,".25 - .75","P","M","Y","N",1,1.5]
["Mustard, tame yellow","F","F","F","N","G","F","F","MH","F","F","CB",12,".25 - .75","P","L","Y","N",0.25,0.75]
["Peas","P","P","P","Y","F","G","F","SL","P","L","CB",70,"1.5 - 3","P","L","Y","M",0.25,0.75]
["Radishes","P","P","G","N","G","P","G","DH","G","F","CB",8,".25 - .5","P","L","Y","N",0.5,1.5]
["Rapeseed","F","F","G","N","F","F","G","MM","G","F","CB",5,".25 - .75","G","L","Y","N",0.5,1.5]
["Red clover","G","F","G","Y","G","F","F","SL","P","F","CB",5,".25 - .75","P","L","Y","M",0.5,1.5]
["Sugar beets","P","P","G","N","F","P","G","DH","G","F","CB",4,".25 - .5","G","L","N","N",0.25,0.5]
["Sweet clover","G","F","F","Y","F","P","F","MM","F","F","CB",4,".25 - 1","F","L","Y","M",1,1.5]
["Turnips","P","P","G","N","G","P","G","DH","G","F","CB",4,".25-.5","P","L","Y","N",0.25,0.75]
["White clover","G","F","G","Y","G","F","F","SL","P","F","CB",1.5,".25 - .75","P","L","Y","M",0.25,0.75]
["Winter camelina","F","F","G","N","F","P","P","ML","G","F","CB",3,".25-.5","P","L","Y","N",0.25,0.75]
["Annual Oregon ryegrass","F","G","G","N","F","G","G","MM","P","F","CG",15,".5-1.5","F","M","Y","L",0.5,1.5]
["Barley","G","G","F","N","G","F","F","MM","F","L","CG",50,".75 - 2","G","M","Y","M",1.5,3]
["Oats","G","G","F","N","F","G","F","MM","F","L","CG",70,".5 - 1.5","F","M","N","M",0.25,0.5]
["Spring wheat","G","G","G","N","G","F","F","MH","F","L","CG",60,".5 - 1.5","F","M","Y","M",0.25,0.75]
["Tall wheatgrass","G","G","G","N","G","G","G","DH","F","L","CG",13,".25 - 1","G","H","N","M",0.25,0.75]
["Triticale","G","G","G","N","G","F","F","MH","F","L","CG",60,".5-1.5","G","M","Y","M",0.5,1]
["Winter wheat or rye","G","G","G","N","G","F","F","MH","F","L","CG",60,".75 - 2","G","M","Y","M",1,1.5]
["Buckwheat","G","F","G","N","G","P","P","SL","P","F","WB",50,".5 - 1.5","P","L","Y","N",0.5,1.5]
["Cowpeas","P","P","F","Y","G","F","F","SL","F","L","WB",30,"1 - 1.5","P","L","Y","M",0.5,1.5]
["Dry beans","P","P","F","Y","G","F","F","SL","F","L","WB",30,"1 - 1.5","P","L","Y","M",0.25,0.5]
["Safflowers","F","F","G","N","F","P","P","DM","F","L","WB",30,".5-1","F","M","Y","M",0.5,1]
["Soybeans","P","P","F","Y","P-G**","F","F","SM","P","L","WB",35,"1-1.5","P","L","Y","M",1.5,2]
["Sunflowers","F","F","G","N","F","P","G","DM","F","L","WB",7,".5-1","F","M","Y","M",0.25,1]
["Sunn hemp","F","F","F","Y","G","P","P","DM","F","L","WB",15,"1.5-2","P","L","Y","Y",0.25,1]
["Corn","G","G","G","N","P-G**","F","F","DH","G","L","WG",12,"1-1.5","P","H","N","H",0.125,0.25]
["Forage sorghum","G","G","G","N","G","G","F","MM","G","L","WG",15,".5 - 1.5","F","M","Y","H",0.5,1.5]
{"$rows_left_out":24}
{"sheet":"Recommended Cover Crop Mixes","index":2,"n_rows":92,"n_cols":9,"rows_kept":92,"cut":false,"hidden":false,"merged":[[0,0,0,7],[7,1,7,2],[7,3,7,7],[8,1,8,2],[8,3,8,7],[9,1,9,2],[9,3,9,7],[2,1,2,2],[2,3,2,7],[5,1,5,8],[6,1,6,2],[6,3,6,7],[16,1,16,2],[16,3,16,7],[77,1,77,8],[78,1,78,2],[78,3,78,7],[79,1,79,2],[79,3,79,7],[12,1,12,8],[13,1,13,2],[13,3,13,7],[14,1,14,2],[14,3,14,7],[15,1,15,2],[15,3,15,7],[22,1,22,2],[22,3,22,7],[23,1,23,2],[23,3,23,7],[55,1,55,8],[56,1,56,2],[56,3,56,7],[18,1,18,8],[19,1,19,2],[19,3,19,7],[20,1,20,2],[20,3,20,7],[21,1,21,2],[21,3,21,7],[25,1,25,8],[26,1,26,2],[26,3,26,7],[27,1,27,2],[27,3,27,7],[42,1,42,8],[43,1,43,2],[43,3,43,7],[66,1,66,8],[67,1,67,2],[67,3,67,7],[68,1,68,2],[68,3,68,7],[61,1,61,8],[62,1,62,2],[62,3,62,7],[63,1,63,2],[63,3,63,7],[64,1,64,2],[64,3,64,7],[28,1,28,2],[28,3,28,7],[29,1,29,2],[29,3,29,7],[30,1,30,2],[30,3,30,7],[39,1,39,2],[39,3,39,7],[40,1,40,2],[40,3,40,7],[36,1,36,2],[36,3,36,7],[37,1,37,2],[37,3,37,7],[38,1,38,2],[38,3,38,7],[31,1,31,2],[31,3,31,7],[33,1,33,8],[34,1,34,2],[34,3,34,7],[35,1,35,2],[35,3,35,7],[74,1,74,2],[74,3,74,7],[75,1,75,2],[75,3,75,7],[81,1,81,8],[82,1,82,2],[82,3,82,7],[44,1,44,2],[44,3,44,7],[45,1,45,2],[45,3,45,7],[72,1,72,8],[73,1,73,2],[73,3,73,7],[70,1,70,2],[70,3,70,7],[69,1,69,2],[69,3,69,7],[57,1,57,2],[57,3,57,7],[58,1,58,2],[58,3,58,7],[59,1,59,2],[59,3,59,7],[91,0,92,7],[86,1,86,2],[86,3,86,7],[87,1,87,2],[87,3,87,7],[88,1,88,2],[88,3,88,7],[83,1,83,2],[83,3,83,7],[84,1,84,2],[84,3,84,7],[85,1,85,2],[85,3,85,7]]}
["                        Recommended Cover Crop Mixes for South Dakota  ",null,null,null,null,null,null,null,2015]
[]
[null,"Species",null,"Variety",null,null,null,null,"Percent"]
[]
[]
[null,"Cool Season Grazing"]
[null,"CSB - legume",null,"field pea, lentil, common vetch, crimson clover",null,null,null,null,"10-30%"]
[null,"Brassica*",null,"dwarf essex rape, radish, turnip, hybrids",null,null,null,null,"0-40%"]
[null,"CSB",null,"flax, camelina",null,null,null,null,"0-15%"]
[null,"CSG",null,"oats, barley, wheat, rye, triticale, annual ryegrass",null,null,null,null,"15-30%"]
[]
[]
[null,"Warm Season Grazing"]
[null,"WSB",null,"sunflower, cowpea, soybean, buckwheat",null,null,null,null,"0-20%"]
[null,"CSB",null,"flax, camelina",null,null,null,null,"0-15%"]
[null,"WSG",null,"millet, teff, sorghum-sudan, corn",null,null,null,null,"20-60%"]
[null,"Brassica",null,"dwarf essex rape, radish, turnip, hybrids",null,null,null,null,"0-40%"]
[]
[null,"Compaction"]
[null,"CSG",null,"oats, barley, wheat, rye, triticale, annual ryegrass",null,null,null,null,"10-50%"]
[null,"CSB - legume",null,"field pea, lentil, common vetch, crimson clover, chickling vetch",null,null,null,null,"0-20%"]
[null,"WSG",null,"sorghum-sudan, teff",null,null,null,null,"0-40%"]
[null,"WSB",null,"Sunflower, safflower",null,null,null,null,"0-15%"]
[null,"Brassica",null,"dwarf essex rape, radish, Barkant turnip, hybrids",null,null,null,null,"20-40%"]
[]
[null,"Residue Cycling"]
[null,"CSB - legume",null,"field pea, lentil, common vetch, crimson clover, chickling vetch",null,null,null,null,"20-40%"]
[null,"CSB",null,"flax, camelina",null,null,null,null,"0-15%"]
[null,"Brassica",null,"dwarf essex rape, radish, mustard, ethiopian cabbage, hybrids",null,null,null,null,"25-40%"]
[null,"WSG",null,"millet, teff",null,null,null,null,"0-10%"]
[null,"WSB - legume",null,"cowpea, soybean, sunn hemp",null,null,null,null,"0-15%"]
[null,"CSG",null,"Oat, annual ryegrass, barley",null,null,null,null,"10-30%"]
[]
[null,"Soil Health - Increase crop diversity and organic matter"]
[null,"CSB - legume",null,"field pea, lentil, common vetch, crimson clover, chickling vetch",null,null,null,null,"10-30%"]
[null,"CSB",null,"flax, camelina",null,null,null,null,"5-15%"]
[null,"Brassica",null,"dwarf essex rape, radish, mustard, ethiopian cabbage, hybrids",null,null,null,null,"5-40%"]
[null,"WSB",null,"Sunflower, safflower, buckwheat",null,null,null,null,"0-15%"]
[null,"WSG",null,"millet, teff, sorghum-sudan, sudangrass",null,null,null,null,"0-30%"]
[null,"WSB - legume",null,"cowpea, soybean, sunn hemp",null,null,null,null,"0-15%"]
{"$rows_left_out":53}
{"sheet":"Aerial Seeding in SB","index":3,"n_rows":32,"n_cols":1,"rows_kept":32,"cut":false,"hidden":true,"merged":[]}
["Guidelines for success when aerial applying cover crops into standing soybeans:"]
[]
["1.  Start aerial application of cover crops when the soybean plant is showing 25-50% yellowing of leaves."]
[]
["2.  Aerial apply cover crops when 40-50% of the sunlight can reach the ground between the rows."]
["(Walk in the field a few rows to determine this)"]
[]
["3.  For success, do not fly cover crops into soybeans that are immature (still very green). The"]
["seeds will most likely germinate and then mold (not enough sunlight to conduct photosynthesis"]
["and too moist of conditions)."]
[]
["4.  Rule of thumb…don't plant in the full shade."]
[]
[]
[]
[]
[]
[]
[]
[]
[]
[]
[]
[]
[]
[]
[]
[]
[]
[]
[]
["The field condition above is ideal for aerial application of cover crops"]

{"sheet":"Aerial Seeding in Corn","index":4,"n_rows":41,"n_cols":1,"rows_kept":41,"cut":false,"hidden":true,"merged":[]}
["Guidelines for success when aerial applying cover crops into standing corn:"]
[]
["1.  Aerial apply cover crops when the corn plant is dried approximately to the ear."]
[]
["2.  Aerial apply cover crops when approximately 50% of the sunlight can reach the ground between the "]
["rows. (Walk in the field a few rows to determine this.)"]
[]
["3.   For success, do not fly cover crops into corn that is im- mature (still very green). The seeds "]
["will most likely germinate and then mold (not enough sunlight to con- duct photosynthesis and too "]
["moist of conditions)."]
[]
[]
[]
[]
[]
[]
[]
[]
[]
[]
[]
[]
[]
[]
[]
[]
[]
[]
[]
[]
[]
[]
[]
[]
[]
[]
[]
[]
[]
[]
{"$rows_left_out":2}
{"sheet":"DATA","index":5,"n_rows":395,"n_cols":47,"rows_kept":395,"cut":false,"hidden":true,"merged":[]}
[]
[]
[null,"April 1 through May 15 – predominantly cool-season species"]
[null,"May 15 through August 1 – predominantly warm-season species",null,null,null,null,null,null,"Reduce erosion from wind and water"]
[null,"August 1 through October 1 – predominantly cool-season species",null,null,null,null,null,null,"Maintain and increase soil health and organic matter content"]
[null,null,null,null,null,null,null,null,"Reduce water quality degradation by utilizing excessive soil nutrients"]
[null,null,null,null,null,null,null,null,"Suppress excessive weed pressures and break pest cycles"]
[null,"Crimp",null,null,null,null,null,null,"Improve soil moisture use efficiency"]
[null,"Frost",null,null,null,null,null,null,"Minimize soil compaction"]
[null,"Harvest"]
[null,"Herbicide"]
[null,"Mow",null,{"$f":"NOW()","v":"2022-04-01T13:28:19.820"},{"$f":"MONTH(D12)","v":4},null,{"$f":"YEAR(D12)","v":2022}]
[null,"Tillage",null,{"$f":"DATEVALUE(H13)","v":"2020-01-15"},1,15,{"$f":"G12-2","v":2020},{"$f":"CONCATENATE(E13,\"/\",15,\"/\",G13)","v":"1/15/2020"}]
[null,null,null,{"$f":"DATEVALUE(H14)","v":"2020-02-15"},{"$f":"E13+1","v":2},15,{"$f":"G13","v":2020},{"$f":"CONCATENATE(E14,\"/\",15,\"/\",G14)","v":"2/15/2020"}]
[null,null,null,"2020-03-15",3,15,{"$f":"G14","v":2020},"3/15/2020"]
[null,"Starter only",null,"2020-04-15",4,15,2020,"4/15/2020"]
[null,"Starter & inoculant",null,"2020-05-15",5,15,2020,"5/15/2020"]
[null,"None",null,"2020-06-15",6,15,2020,"6/15/2020"]
[null,"Inoculant only",null,"2020-07-15",7,15,2020,"7/15/2020"]
[null,null,null,"2020-08-15",8,15,2020,"8/15/2020"]
[null,null,null,"2020-09-15",9,15,2020,"9/15/2020"]
[null,"Drill",null,"2020-10-15",10,15,2020,"10/15/2020"]
[null,"Broadcast",null,"2020-11-15",11,15,2020,"11/15/2020"]
[null,null,null,"2020-12-15",12,15,2020,"12/15/2020"]
[null,null,null,"2021-01-15",1,15,{"$f":"G24+1","v":2021},"1/15/2021"]
[null,null,null,"2021-02-15",{"$f":"E25+1","v":2},15,{"$f":"G25","v":2021},"2/15/2021"]
[null,null,null,"2021-03-15",3,15,{"$f":"G26","v":2021},"3/15/2021"]
[null,null,null,"2021-04-15",4,15,2021,"4/15/2021"]
[null,null,null,"2021-05-15",5,15,2021,"5/15/2021"]
[null,null,null,"2021-06-15",6,15,2021,"6/15/2021"]
[null,null,null,"2021-07-15",7,15,2021,"7/15/2021"]
[null,null,null,"2021-08-15",8,15,2021,"8/15/2021"]
[null,null,null,"2021-09-15",9,15,2021,"9/15/2021"]
["Alfalfa",null,null,"2021-10-15",10,15,2021,"10/15/2021"]
["Alsike clover",null,null,"2021-11-15",11,15,2021,"11/15/2021"]
["Annual Oregon ryegrass",null,null,"2021-12-15",12,15,2021,"12/15/2021"]
["Canola",null,null,"2022-01-15",1,15,{"$f":"G36+1","v":2022},"1/15/2022"]
["Crimson clover",null,null,"2022-02-15",{"$f":"E37+1","v":2},15,{"$f":"G37","v":2022},"2/15/2022"]
["Ethiopian cabbage",null,null,"2022-03-15",3,15,{"$f":"G38","v":2022},"3/15/2022"]
["Kale",null,null,"2022-04-15",4,15,2022,"4/15/2022"]
{"$rows_left_out":355}